Reaction Details
TargetHistone-lysine N-methyltransferase EHMT2
LigandBDBM50396016
Substrate/Competitorn/a
Meas. Tech.ChEMBL_861217 (CHEMBL2173355)
IC50>100000±n/a nM
Citation Decarlo, DHadden, MK Oncoepigenomics: making histone lysine methylation count. Eur J Med Chem56:179-194 (2012) 
 
Histone-lysine N-methyltransferase EHMT2
Name:Histone-lysine N-methyltransferase EHMT2
Type:Enzyme
Mol. Mass.:132339.87
Organism:Homo sapiens (Human)
Description:Q96KQ7
Residue:1210
BDBM50396016
NameBDBM50396016
Synonyms:CHEMBL2169918
TypeSmall organic molecule
Emp. Form.C24H32IN7O5
Mol. Mass.625.4593
SMILESN[C@@H](CCCN(CCI)C[C@H]1O[C@H]([C@H](O)[C@@H]1O)n1cnc2c(NCc3ccccc3)ncnc12)C(O)=O