Reaction Details
TargetLysine-specific demethylase 4E
LigandBDBM50396018
Substrate/Competitorn/a
Meas. Tech.ChEMBL_861177 (CHEMBL2173245)
IC50 2400±n/a nM
Citation Decarlo, DHadden, MK Oncoepigenomics: making histone lysine methylation count. Eur J Med Chem56:179-194 (2012) 
 
Lysine-specific demethylase 4E
Name:Lysine-specific demethylase 4E
Type:Enzyme
Mol. Mass.:56815.71
Organism:Homo sapiens (Human)
Description:B2RXH2
Residue:506
BDBM50396018
NameBDBM50396018
Synonyms:CHEMBL1230640
TypeSmall organic molecule
Emp. Form.C10H7NO3
Mol. Mass.189.1675
SMILESOC(=O)c1ccc(O)c2ncccc12