Reaction Details
TargetLysine-specific histone demethylase 1A
LigandBDBM50396021
Substrate/Competitorn/a
Meas. Tech.ChEMBL_861226 (CHEMBL2173364)
IC50 500±n/a nM
Citation Decarlo, DHadden, MK Oncoepigenomics: making histone lysine methylation count. Eur J Med Chem56:179-194 (2012) 
 
Lysine-specific histone demethylase 1A
Name:Lysine-specific histone demethylase 1A
Type:Enzyme
Mol. Mass.:92901.01
Organism:Homo sapiens (Human)
Description:O60341
Residue:852
BDBM50396021
NameBDBM50396021
Synonyms:CHEMBL1196431
TypeSmall organic molecule
Emp. Form.C40H90N10
Mol. Mass.711.2096
\C=C/CNCCCCNCCCCNCCCCNCCCCNCC