Reaction Details
TargetHistone-lysine N-methyltransferase, H3 lysine-79 specific
LigandBDBM50396016
Substrate/Competitorn/a
Meas. Tech.ChEMBL_861242 (CHEMBL2173380)
IC50 110±n/a nM
Citation Decarlo, DHadden, MK Oncoepigenomics: making histone lysine methylation count. Eur J Med Chem56:179-194 (2012) 
 
Histone-lysine N-methyltransferase, H3 lysine-79 specific
Name:Histone-lysine N-methyltransferase, H3 lysine-79 specific
Type:Protein
Mol. Mass.:184911.91
Organism:Homo sapiens (Human)
Description:Q8TEK3
Residue:1537
BDBM50396016
NameBDBM50396016
Synonyms:CHEMBL2169918
TypeSmall organic molecule
Emp. Form.C24H32IN7O5
Mol. Mass.625.4593
SMILESN[C@@H](CCCN(CCI)C[C@H]1O[C@H]([C@H](O)[C@@H]1O)n1cnc2c(NCc3ccccc3)ncnc12)C(O)=O