Reaction Details
TargetTyrosine-protein kinase JAK2
LigandBDBM50396150
Substrate/Competitorn/a
Meas. Tech.ChEMBL_862780 (CHEMBL2174492)
Ki 3000±n/a nM
Citation Chen, HChan, BKDrummond, JEstrada, AAGunzner-Toste, JLiu, XLiu, YMoffat, JShore, DSweeney, ZKTran, TWang, SZhao, GZhu, HBurdick, DJ Discovery of selective LRRK2 inhibitors guided by computational analysis and molecular modeling. J Med Chem55:5536-45 (2012) 
 
Tyrosine-protein kinase JAK2
Name:Tyrosine-protein kinase JAK2
Type:Protein
Mol. Mass.:130684.68
Organism:Homo sapiens (Human)
Description:O60674
Residue:1132
BDBM50396150
NameBDBM50396150
Synonyms:CHEMBL2171743
TypeSmall organic molecule
Emp. Form.C17H20BrN5O3
Mol. Mass.422.276
SMILESCNc1nc(Nc2ccc(cc2OC)C(=O)N2CCOCC2)ncc1Br