Reaction Details
TargetALK tyrosine kinase receptor
LigandBDBM50396262
Substrate/Competitorn/a
Meas. Tech.ChEMBL_863883 (CHEMBL2176367)
IC50 48±n/a nM
Citation Lewis, RTBode, CMChoquette, DMPotashman, MRomero, KStellwagen, JCTeffera, YMoore, EWhittington, DAChen, HEpstein, LFEmkey, RAndrews, PSYu, VLSaffran, DCXu, MDrew, AMerkel, PSzilvassy, SBrake, RL The discovery and optimization of a novel class of potent, selective, and orally bioavailable anaplastic lymphoma kinase (ALK) inhibitors with potential utility for the treatment of cancer. J Med Chem55:6523-40 (2012) 
 
ALK tyrosine kinase receptor
Name:ALK tyrosine kinase receptor
Type:Protein
Mol. Mass.:176453.10
Organism:Homo sapiens (Human)
Description:Q9UM73
Residue:1620
BDBM50396262
NameBDBM50396262
Synonyms:CHEMBL2172322
TypeSmall organic molecule
Emp. Form.C30H39N5O4S
Mol. Mass.565.727
SMILESOC[C@H]1CC[C@H](CC1)n1c(NC(=O)c2cccc(c2)S(=O)(=O)NCC=C)nc2cc(CN3CCCCC3)ccc12