Reaction Details
TargetTyrosine-protein kinase Mer
LigandBDBM50396263
Substrate/Competitorn/a
Meas. Tech.ChEMBL_863857 (CHEMBL2176247)
Kd 72±n/a nM
Citation Lewis, RTBode, CMChoquette, DMPotashman, MRomero, KStellwagen, JCTeffera, YMoore, EWhittington, DAChen, HEpstein, LFEmkey, RAndrews, PSYu, VLSaffran, DCXu, MDrew, AMerkel, PSzilvassy, SBrake, RL The discovery and optimization of a novel class of potent, selective, and orally bioavailable anaplastic lymphoma kinase (ALK) inhibitors with potential utility for the treatment of cancer. J Med Chem55:6523-40 (2012) 
 
Tyrosine-protein kinase Mer
Name:Tyrosine-protein kinase Mer
Type:PROTEIN
Mol. Mass.:110234.77
Organism:Homo sapiens (Human)
Description:ChEMBL_1498723
Residue:999
BDBM50396263
NameBDBM50396263
Synonyms:CHEMBL2172315
TypeSmall organic molecule
Emp. Form.C33H43F2N5O3
Mol. Mass.595.723
SMILESCC(C)NC(=O)[C@H]1CC[C@H](CC1)n1c(NC(=O)c2cc(F)cc(F)c2)nc2ccc(CN3CCC(CC3)C(C)(C)O)cc12