Reaction Details
TargetCytochrome P450 3A4
LigandBDBM50396557
Substrate/Competitorn/a
Meas. Tech.ChEMBL_863248 (CHEMBL2176191)
IC50 15±n/a nM
Citation Ruf, SBuning, CSchreuder, HHorstick, GLinz, WOlpp, TPernerstorfer, JHiss, KKroll, KKannt, AKohlmann, MLinz, DHübschle, TRütten, HWirth, KSchmidt, TSadowski, T Novelß-amino acid derivatives as inhibitors of cathepsin A. J Med Chem55:7636-49 (2012) 
 
Cytochrome P450 3A4
Name:Cytochrome P450 3A4
Type:Enzyme
Mol. Mass.:57349.57
Organism:Homo sapiens (Human)
Description:n/a
Residue:503
BDBM50396557
NameBDBM50396557
Synonyms:CHEMBL2171397
TypeSmall organic molecule
Emp. Form.C22H22FN3O4
Mol. Mass.411.4262
SMILESCCOc1cc(nn1-c1ccccc1F)C(=O)N[C@@H](CC(O)=O)c1ccccc1C