Reaction Details
TargetCytochrome P450 3A4
LigandBDBM50396558
Substrate/Competitorn/a
Meas. Tech.ChEMBL_863248 (CHEMBL2176191)
IC50 38±n/a nM
Citation Ruf, SBuning, CSchreuder, HHorstick, GLinz, WOlpp, TPernerstorfer, JHiss, KKroll, KKannt, AKohlmann, MLinz, DHübschle, TRütten, HWirth, KSchmidt, TSadowski, T Novelß-amino acid derivatives as inhibitors of cathepsin A. J Med Chem55:7636-49 (2012) 
 
Cytochrome P450 3A4
Name:Cytochrome P450 3A4
Type:Enzyme
Mol. Mass.:57349.57
Organism:Homo sapiens (Human)
Description:n/a
Residue:503
BDBM50396558
NameBDBM50396558
Synonyms:CHEMBL2171403
TypeSmall organic molecule
Emp. Form.C20H18FN3O4
Mol. Mass.383.373
SMILESCc1ccccc1[C@H](CC(O)=O)NC(=O)c1cc(=O)n([nH]1)-c1ccccc1F