Reaction Details
TargetLysosomal protective protein
LigandBDBM50396563
Substrate/Competitorn/a
Meas. Tech.ChEMBL_863255 (CHEMBL2176198)
IC50 60±n/a nM
Citation Ruf, SBuning, CSchreuder, HHorstick, GLinz, WOlpp, TPernerstorfer, JHiss, KKroll, KKannt, AKohlmann, MLinz, DHübschle, TRütten, HWirth, KSchmidt, TSadowski, T Novelß-amino acid derivatives as inhibitors of cathepsin A. J Med Chem55:7636-49 (2012) 
 
Lysosomal protective protein
Name:Lysosomal protective protein
Type:Protein
Mol. Mass.:54465.95
Organism:Homo sapiens (Human)
Description:P10619
Residue:480
BDBM50396563
NameBDBM50396563
Synonyms:CHEMBL2171391
TypeSmall organic molecule
Emp. Form.C25H24Cl2FN3O5
Mol. Mass.536.38
SMILESCC(C)(C)C(=O)COc1cc(nn1-c1ccccc1F)C(=O)N[C@@H](CC(O)=O)c1ccc(Cl)cc1Cl