Reaction Details
TargetLysosomal protective protein
LigandBDBM50396568
Substrate/Competitorn/a
Meas. Tech.ChEMBL_863255 (CHEMBL2176198)
IC50 5380±n/a nM
Citation Ruf, SBuning, CSchreuder, HHorstick, GLinz, WOlpp, TPernerstorfer, JHiss, KKroll, KKannt, AKohlmann, MLinz, DHübschle, TRütten, HWirth, KSchmidt, TSadowski, T Novelß-amino acid derivatives as inhibitors of cathepsin A. J Med Chem55:7636-49 (2012) 
 
Lysosomal protective protein
Name:Lysosomal protective protein
Type:Protein
Mol. Mass.:54465.95
Organism:Homo sapiens (Human)
Description:P10619
Residue:480
BDBM50396568
NameBDBM50396568
Synonyms:CHEMBL2171386
TypeSmall organic molecule
Emp. Form.C21H20FN3O4
Mol. Mass.397.3996
SMILESCc1ccc(C)c(c1)-n1[nH]c(cc1=O)C(=O)NC(CC(O)=O)c1ccc(F)cc1