Reaction Details
TargetLysosomal protective protein
LigandBDBM50396576
Substrate/Competitorn/a
Meas. Tech.ChEMBL_863255 (CHEMBL2176198)
IC50 102±n/a nM
Citation Ruf, SBuning, CSchreuder, HHorstick, GLinz, WOlpp, TPernerstorfer, JHiss, KKroll, KKannt, AKohlmann, MLinz, DHübschle, TRütten, HWirth, KSchmidt, TSadowski, T Novelß-amino acid derivatives as inhibitors of cathepsin A. J Med Chem55:7636-49 (2012) 
 
Lysosomal protective protein
Name:Lysosomal protective protein
Type:Protein
Mol. Mass.:54465.95
Organism:Homo sapiens (Human)
Description:P10619
Residue:480
BDBM50396576
NameBDBM50396576
Synonyms:CHEMBL2171605
TypeSmall organic molecule
Emp. Form.C20H18ClN3O4
Mol. Mass.399.828
SMILESCc1ccccc1[C@H](CC(O)=O)NC(=O)c1cc(=O)n([nH]1)-c1cccc(Cl)c1