Reaction Details
TargetLysosomal protective protein
LigandBDBM50396577
Substrate/Competitorn/a
Meas. Tech.ChEMBL_863255 (CHEMBL2176198)
IC50 120±n/a nM
Citation Ruf, SBuning, CSchreuder, HHorstick, GLinz, WOlpp, TPernerstorfer, JHiss, KKroll, KKannt, AKohlmann, MLinz, DHübschle, TRütten, HWirth, KSchmidt, TSadowski, T Novelß-amino acid derivatives as inhibitors of cathepsin A. J Med Chem55:7636-49 (2012) 
 
Lysosomal protective protein
Name:Lysosomal protective protein
Type:Protein
Mol. Mass.:54465.95
Organism:Homo sapiens (Human)
Description:P10619
Residue:480
BDBM50396577
NameBDBM50396577
Synonyms:CHEMBL2169904
TypeSmall organic molecule
Emp. Form.C19H13Cl2F2N3O4
Mol. Mass.456.227
SMILESOC(=O)CC(NC(=O)c1cc(=O)n([nH]1)-c1ccc(F)cc1F)c1cccc(Cl)c1Cl