Reaction Details
TargetLysosomal protective protein
LigandBDBM50396579
Substrate/Competitorn/a
Meas. Tech.ChEMBL_863255 (CHEMBL2176198)
IC50 100±n/a nM
Citation Ruf, SBuning, CSchreuder, HHorstick, GLinz, WOlpp, TPernerstorfer, JHiss, KKroll, KKannt, AKohlmann, MLinz, DHübschle, TRütten, HWirth, KSchmidt, TSadowski, T Novelß-amino acid derivatives as inhibitors of cathepsin A. J Med Chem55:7636-49 (2012) 
 
Lysosomal protective protein
Name:Lysosomal protective protein
Type:Protein
Mol. Mass.:54465.95
Organism:Homo sapiens (Human)
Description:P10619
Residue:480
BDBM50396579
NameBDBM50396579
Synonyms:CHEMBL2171407
TypeSmall organic molecule
Emp. Form.C19H15Cl2N3O4
Mol. Mass.420.246
SMILESOC(=O)CC(NC(=O)c1cc(=O)n([nH]1)-c1ccccc1)c1cccc(Cl)c1Cl