Reaction Details
TargetNeprilysin
LigandBDBM50396556
Substrate/Competitorn/a
Meas. Tech.ChEMBL_863254 (CHEMBL2176197)
IC50 27000±n/a nM
Citation Ruf, SBuning, CSchreuder, HHorstick, GLinz, WOlpp, TPernerstorfer, JHiss, KKroll, KKannt, AKohlmann, MLinz, DHübschle, TRütten, HWirth, KSchmidt, TSadowski, T Novelß-amino acid derivatives as inhibitors of cathepsin A. J Med Chem55:7636-49 (2012) 
 
Neprilysin
Name:Neprilysin
Type:Enzyme
Mol. Mass.:85505.38
Organism:Homo sapiens (Human)
Description:P08473
Residue:750
BDBM50396556
NameBDBM50396556
Synonyms:CHEMBL2171398
TypeSmall organic molecule
Emp. Form.C24H24FN3O4
Mol. Mass.437.4635
SMILESCc1ccccc1[C@H](CC(O)=O)NC(=O)c1cc(OCC2CC2)n(n1)-c1ccccc1F