Reaction Details
TargetAldo-keto reductase family 1 member C3
LigandBDBM50396731
Substrate/Competitorn/a
Meas. Tech.ChEMBL_864305 (CHEMBL2175576)
Ki 4000±n/a nM
Citation Brožic, PTurk, SAdeniji, AOKonc, JJanežic, DPenning, TMLanišnik Rižner, TGobec, S Selective inhibitors of aldo-keto reductases AKR1C1 and AKR1C3 discovered by virtual screening of a fragment library. J Med Chem55:7417-24 (2012) 
 
Aldo-keto reductase family 1 member C3
Name:Aldo-keto reductase family 1 member C3
Type:Enzyme
Mol. Mass.:36859.86
Organism:Homo sapiens (Human)
Description:P42330
Residue:323
BDBM50396731
NameBDBM50396731
Synonyms:CHEMBL2172254
TypeSmall organic molecule
Emp. Form.C15H10O5
Mol. Mass.270.2369
SMILESOC(=O)COc1ccc2c(c1)oc(=O)c1ccccc21