Reaction Details
TargetAldo-keto reductase family 1 member C3
LigandBDBM50396732
Substrate/Competitorn/a
Meas. Tech.ChEMBL_864305 (CHEMBL2175576)
Ki 54000±n/a nM
Citation Brožic, PTurk, SAdeniji, AOKonc, JJanežic, DPenning, TMLanišnik Rižner, TGobec, S Selective inhibitors of aldo-keto reductases AKR1C1 and AKR1C3 discovered by virtual screening of a fragment library. J Med Chem55:7417-24 (2012) 
 
Aldo-keto reductase family 1 member C3
Name:Aldo-keto reductase family 1 member C3
Type:Enzyme
Mol. Mass.:36859.86
Organism:Homo sapiens (Human)
Description:P42330
Residue:323
BDBM50396732
NameBDBM50396732
Synonyms:CHEMBL2172252
TypeSmall organic molecule
Emp. Form.C16H11NO3
Mol. Mass.265.2634
SMILESOC(=O)c1cc(nc2ccccc12)-c1cccc(O)c1