Reaction Details
TargetAldo-keto reductase family 1 member C2
LigandBDBM50396739
Substrate/Competitorn/a
Meas. Tech.ChEMBL_864306 (CHEMBL2175577)
Ki 58000±n/a nM
Citation Brožic, PTurk, SAdeniji, AOKonc, JJanežic, DPenning, TMLanišnik Rižner, TGobec, S Selective inhibitors of aldo-keto reductases AKR1C1 and AKR1C3 discovered by virtual screening of a fragment library. J Med Chem55:7417-24 (2012) 
 
Aldo-keto reductase family 1 member C2
Name:Aldo-keto reductase family 1 member C2
Type:Enzyme
Mol. Mass.:36739.89
Organism:Homo sapiens (Human)
Description:n/a
Residue:323
BDBM50396739
NameBDBM50396739
Synonyms:CHEMBL2172243
TypeSmall organic molecule
Emp. Form.C14H12N2O3
Mol. Mass.256.2567
SMILESNC(=O)c1ccccc1\N=C\c1cccc(O)c1O