Reaction Details
TargetAldo-keto reductase family 1 member C1
LigandBDBM50396745
Substrate/Competitorn/a
Meas. Tech.ChEMBL_864307 (CHEMBL2175578)
Ki 89000±n/a nM
Citation Brožic, PTurk, SAdeniji, AOKonc, JJanežic, DPenning, TMLanišnik Rižner, TGobec, S Selective inhibitors of aldo-keto reductases AKR1C1 and AKR1C3 discovered by virtual screening of a fragment library. J Med Chem55:7417-24 (2012) 
 
Aldo-keto reductase family 1 member C1
Name:Aldo-keto reductase family 1 member C1
Type:Enzyme
Mol. Mass.:36793.97
Organism:Homo sapiens (Human)
Description:Recombinant AKR1C1 enzyme was expressed in E. coli.
Residue:323
BDBM50396745
NameBDBM50396745
Synonyms:CHEMBL1580175
TypeSmall organic molecule
Emp. Form.C16H14N2O
Mol. Mass.250.2952
SMILESCC(=O)Nc1ccc(cc1)C(C#N)c1ccccc1