Reaction Details
TargetAldo-keto reductase family 1 member C1
LigandBDBM50396733
Substrate/Competitorn/a
Meas. Tech.ChEMBL_864307 (CHEMBL2175578)
Ki 90000±n/a nM
Citation Brožic, PTurk, SAdeniji, AOKonc, JJanežic, DPenning, TMLanišnik Rižner, TGobec, S Selective inhibitors of aldo-keto reductases AKR1C1 and AKR1C3 discovered by virtual screening of a fragment library. J Med Chem55:7417-24 (2012) 
 
Aldo-keto reductase family 1 member C1
Name:Aldo-keto reductase family 1 member C1
Type:Enzyme
Mol. Mass.:36793.97
Organism:Homo sapiens (Human)
Description:Recombinant AKR1C1 enzyme was expressed in E. coli.
Residue:323
BDBM50396733
NameBDBM50396733
Synonyms:CHEMBL2172251
TypeSmall organic molecule
Emp. Form.C15H13N3O2
Mol. Mass.267.2826
SMILESCc1ccn(Cc2cc(C(O)=O)c3ccccc3n2)n1