Reaction Details
TargetPhosphodiesterase
LigandBDBM50397085
Substrate/Competitorn/a
Meas. Tech.ChEMBL_863634 (CHEMBL2175366)
IC50 1000±n/a nM
Citation Orrling, KMJansen, CVu, XLBalmer, VBregy, PShanmugham, AEngland, PBailey, DCos, PMaes, LAdams, Evan den Bogaart, EChatelain, EIoset, JRvan de Stolpe, AZorg, SVeerman, JSeebeck, TSterk, GJde Esch, IJLeurs, R Catechol pyrazolinones as trypanocidals: fragment-based design, synthesis, and pharmacological evaluation of nanomolar inhibitors of trypanosomal phosphodiesterase B1. J Med Chem55:8745-56 (2012) 
 
Phosphodiesterase
Name:Phosphodiesterase
Type:Protein
Mol. Mass.:103683.20
Organism:Trypanosoma brucei
Description:n/a
Residue:930
BDBM50397085
NameBDBM50397085
Synonyms:CHEMBL2171457
TypeSmall organic molecule
Emp. Form.C27H31N3O3
Mol. Mass.445.5533
SMILESCOc1ccc(cc1OCc1ccc(cc1)C#N)C1=NN(C2CCCCCC2)C(=O)C1(C)C