Reaction Details
TargetPhosphodiesterase
LigandBDBM50397102
Substrate/Competitorn/a
Meas. Tech.ChEMBL_863634 (CHEMBL2175366)
IC50 500±n/a nM
Citation Orrling, KMJansen, CVu, XLBalmer, VBregy, PShanmugham, AEngland, PBailey, DCos, PMaes, LAdams, Evan den Bogaart, EChatelain, EIoset, JRvan de Stolpe, AZorg, SVeerman, JSeebeck, TSterk, GJde Esch, IJLeurs, R Catechol pyrazolinones as trypanocidals: fragment-based design, synthesis, and pharmacological evaluation of nanomolar inhibitors of trypanosomal phosphodiesterase B1. J Med Chem55:8745-56 (2012) 
 
Phosphodiesterase
Name:Phosphodiesterase
Type:Protein
Mol. Mass.:103683.20
Organism:Trypanosoma brucei
Description:n/a
Residue:930
BDBM50397102
NameBDBM50397102
Synonyms:CHEMBL2171664
TypeSmall organic molecule
Emp. Form.C26H32N2O3
Mol. Mass.420.5439
SMILESCOc1ccc(cc1OCc1ccccc1)C1=NN(C2CCCCCC2)C(=O)C1(C)C