Reaction Details
TargetPhosphodiesterase
LigandBDBM50397108
Substrate/Competitorn/a
Meas. Tech.ChEMBL_863627 (CHEMBL2175359)
IC50 4±n/a nM
Citation Orrling, KMJansen, CVu, XLBalmer, VBregy, PShanmugham, AEngland, PBailey, DCos, PMaes, LAdams, Evan den Bogaart, EChatelain, EIoset, JRvan de Stolpe, AZorg, SVeerman, JSeebeck, TSterk, GJde Esch, IJLeurs, R Catechol pyrazolinones as trypanocidals: fragment-based design, synthesis, and pharmacological evaluation of nanomolar inhibitors of trypanosomal phosphodiesterase B1. J Med Chem55:8745-56 (2012) 
 
Phosphodiesterase
Name:Phosphodiesterase
Type:Protein
Mol. Mass.:103683.20
Organism:Trypanosoma brucei
Description:n/a
Residue:930
BDBM50397108
NameBDBM50397108
Synonyms:CHEMBL85005
TypeSmall organic molecule
Emp. Form.C33H40N6O4
Mol. Mass.584.7085
SMILESCOc1ccc(cc1OCCCCOc1ccc(cc1)-c1nnn[nH]1)C1=NN(C2CCCCCC2)C(=O)C2CC=CCC12