Reaction Details
TargetP2Y purinoceptor 12
LigandBDBM50397203
Substrate/Competitorn/a
Meas. Tech.ChEMBL_864185 (CHEMBL2175134)
Ki 86±n/a nM
Citation Zech, GHessler, GEvers, AWeiss, TFlorian, PJust, MCzech, JCzechtizky, WGörlitzer, JRuf, SKohlmann, MNazaré, M Identification of high-affinity P2Y12 antagonists based on a phenylpyrazole glutamic acid piperazine backbone. J Med Chem55:8615-29 (2012) 
 
P2Y purinoceptor 12
Name:P2Y purinoceptor 12
Type:Enzyme
Mol. Mass.:39458.48
Organism:Homo sapiens (Human)
Description:Q9H244
Residue:342
BDBM50397203
NameBDBM50397203
Synonyms:CHEMBL2172275
TypeSmall organic molecule
Emp. Form.C29H38N4O9
Mol. Mass.586.6334
SMILESCCOC(=O)N1CCN(CC1)C(=O)[C@H](CCC(O)=O)NC(=O)c1cc(OC(C)(C)C(=O)OCC)c2ccc(C)cc2n1