Reaction Details
TargetPolyunsaturated fatty acid 5-lipoxygenase
LigandBDBM50397228
Substrate/Competitorn/a
Meas. Tech.ChEMBL_864588 (CHEMBL2176568)
IC50 3700±n/a nM
Citation Elkady, MNieß, RSchaible, AMBauer, JLuderer, SAmbrosi, GWerz, OLaufer, SA Modified acidic nonsteroidal anti-inflammatory drugs as dual inhibitors of mPGES-1 and 5-LOX. J Med Chem55:8958-62 (2012) 
 
Polyunsaturated fatty acid 5-lipoxygenase
Name:Polyunsaturated fatty acid 5-lipoxygenase
Type:Enzyme
Mol. Mass.:77972.74
Organism:Homo sapiens (Human)
Description:Recombinant protein was purified from E. coli lysate. After ammonium sulfate precipitation and subsequent steps, the supernatant (S100) was used for 5-LO activity assay.
Residue:674
BDBM50397228
NameBDBM50397228
Synonyms:CHEMBL2172775
TypeSmall organic molecule
Emp. Form.C25H17ClN2O2
Mol. Mass.412.868
SMILESOC(=O)Cc1cn(nc1-c1ccc(cc1)C#Cc1ccc(Cl)cc1)-c1ccccc1