Reaction Details
TargetPolyunsaturated fatty acid 5-lipoxygenase
LigandBDBM50397236
Substrate/Competitorn/a
Meas. Tech.ChEMBL_864588 (CHEMBL2176568)
IC50 6800±n/a nM
Citation Elkady, MNieß, RSchaible, AMBauer, JLuderer, SAmbrosi, GWerz, OLaufer, SA Modified acidic nonsteroidal anti-inflammatory drugs as dual inhibitors of mPGES-1 and 5-LOX. J Med Chem55:8958-62 (2012) 
 
Polyunsaturated fatty acid 5-lipoxygenase
Name:Polyunsaturated fatty acid 5-lipoxygenase
Type:Enzyme
Mol. Mass.:77972.74
Organism:Homo sapiens (Human)
Description:Recombinant protein was purified from E. coli lysate. After ammonium sulfate precipitation and subsequent steps, the supernatant (S100) was used for 5-LO activity assay.
Residue:674
BDBM50397236
NameBDBM50397236
Synonyms:CHEMBL2172790
TypeSmall organic molecule
Emp. Form.C23H18ClN3O3S
Mol. Mass.451.925
SMILESClc1ccc(cc1)-c1nn(cc1CC(=O)NS(=O)(=O)c1ccccc1)-c1ccccc1