Reaction Details
TargetProstaglandin E synthase
LigandBDBM17638
Substrate/Competitorn/a
Meas. Tech.ChEMBL_864584 (CHEMBL2176564)
IC50 40600±n/a nM
Citation Elkady, MNieß, RSchaible, AMBauer, JLuderer, SAmbrosi, GWerz, OLaufer, SA Modified acidic nonsteroidal anti-inflammatory drugs as dual inhibitors of mPGES-1 and 5-LOX. J Med Chem55:8958-62 (2012) 
 
Prostaglandin E synthase
Name:Prostaglandin E synthase
Type:Protein
Mol. Mass.:17112.22
Organism:Homo sapiens (Human)
Description:n/a
Residue:152
BDBM17638
NameBDBM17638
Synonyms:2-{1-[(4-chlorophenyl)carbonyl]-5-methoxy-2-methyl-1H-indol-3-yl}acetic acid Indocin US11478464, Compound Indomethacin US9271961, Indomethacin | indometacin
TypeSmall organic molecule
Emp. Form.C19H16ClNO4
Mol. Mass.357.788
SMILESCOc1ccc2n(C(=O)c3ccc(Cl)cc3)c(C)c(CC(O)=O)c2c1