Reaction Details
Target5-hydroxytryptamine receptor 3A
LigandBDBM50397285
Substrate/Competitorn/a
Meas. Tech.ChEMBL_864726 (CHEMBL2174993)
Ki 13.49±n/a nM
Citation Verheij, MHThompson, AJvan Muijlwijk-Koezen, JELummis, SCLeurs, Rde Esch, IJ Design, synthesis, and structure-activity relationships of highly potent 5-HT3 receptor ligands. J Med Chem55:8603-14 (2012) 
 
5-hydroxytryptamine receptor 3A
Name:5-hydroxytryptamine receptor 3A
Type:Protein
Mol. Mass.:55283.27
Organism:Homo sapiens (Human)
Description:P46098
Residue:478
BDBM50397285
NameBDBM50397285
Synonyms:CHEMBL2169969
TypeSmall organic molecule
Emp. Form.C15H20N4
Mol. Mass.256.3461
SMILESCNc1cc(nc2ccccc12)N1CCN(C)CC1