Reaction Details
Target5-hydroxytryptamine receptor 3A
LigandBDBM50397294
Substrate/Competitorn/a
Meas. Tech.ChEMBL_864726 (CHEMBL2174993)
Ki 2.69±n/a nM
Citation Verheij, MHThompson, AJvan Muijlwijk-Koezen, JELummis, SCLeurs, Rde Esch, IJ Design, synthesis, and structure-activity relationships of highly potent 5-HT3 receptor ligands. J Med Chem55:8603-14 (2012) 
 
5-hydroxytryptamine receptor 3A
Name:5-hydroxytryptamine receptor 3A
Type:Protein
Mol. Mass.:55283.27
Organism:Homo sapiens (Human)
Description:P46098
Residue:478
BDBM50397294
NameBDBM50397294
Synonyms:CHEMBL489271 | VUF-10509
TypeSmall organic molecule
Emp. Form.C20H23ClN6
Mol. Mass.382.89
SMILESCN1CCN(CC1)c1nc(NCc2ccc(N)cc2)c2cc(Cl)ccc2n1