Reaction Details
Target5-hydroxytryptamine receptor 3A
LigandBDBM50397295
Substrate/Competitorn/a
Meas. Tech.ChEMBL_864726 (CHEMBL2174993)
Ki 79.43±n/a nM
Citation Verheij, MHThompson, AJvan Muijlwijk-Koezen, JELummis, SCLeurs, Rde Esch, IJ Design, synthesis, and structure-activity relationships of highly potent 5-HT3 receptor ligands. J Med Chem55:8603-14 (2012) 
 
5-hydroxytryptamine receptor 3A
Name:5-hydroxytryptamine receptor 3A
Type:Protein
Mol. Mass.:55283.27
Organism:Homo sapiens (Human)
Description:P46098
Residue:478
BDBM50397295
NameBDBM50397295
Synonyms:CHEMBL490072 | VUF-10453
TypeSmall organic molecule
Emp. Form.C21H24ClN5
Mol. Mass.381.902
SMILESCN1CCN(CC1)c1nc(NCCc2ccccc2)c2cc(Cl)ccc2n1