Reaction Details
Target5-hydroxytryptamine receptor 3A
LigandBDBM50397308
Substrate/Competitorn/a
Meas. Tech.ChEMBL_864726 (CHEMBL2174993)
Ki 18.2±n/a nM
Citation Verheij, MHThompson, AJvan Muijlwijk-Koezen, JELummis, SCLeurs, Rde Esch, IJ Design, synthesis, and structure-activity relationships of highly potent 5-HT3 receptor ligands. J Med Chem55:8603-14 (2012) 
 
5-hydroxytryptamine receptor 3A
Name:5-hydroxytryptamine receptor 3A
Type:Protein
Mol. Mass.:55283.27
Organism:Homo sapiens (Human)
Description:P46098
Residue:478
BDBM50397308
NameBDBM50397308
Synonyms:CHEMBL511699
TypeSmall organic molecule
Emp. Form.C15H20ClN5
Mol. Mass.305.806
SMILESCNc1nc(nc2ccc(Cl)cc12)N1CCCN(C)CC1