Reaction Details
TargetSterol O-acyltransferase 1
LigandBDBM50397448
Substrate/Competitorn/a
Meas. Tech.ChEMBL_864990 (CHEMBL2176154)
IC50 800±n/a nM
Citation Pokhrel, LMaezawa, INguyen, TDChang, KOJin, LWHua, DH Inhibition of Acyl-CoA: cholesterol acyltransferase (ACAT), overexpression of cholesterol transporter gene, and protection of amyloidß (Aß) oligomers-induced neuronal cell death by tricyclic pyrone molecules. J Med Chem55:8969-73 (2012) 
 
Sterol O-acyltransferase 1
Name:Sterol O-acyltransferase 1
Type:Multi-pass membrane protein may form homo- or heterodimers.
Mol. Mass.:64751.94
Organism:Homo sapiens (Human)
Description:P35610
Residue:550
BDBM50397448
NameBDBM50397448
Synonyms:CHEMBL2170728
TypeSmall organic molecule
Emp. Form.C27H29NO4
Mol. Mass.431.5235
SMILESCC(CNCc1ccc(O)c2ccccc12)[C@H]1CCC2=Cc3c(O[C@H]2C1)cc(C)oc3=O