Reaction Details
TargetCytochrome P450 2C8
LigandBDBM50397663
Substrate/Competitorn/a
Meas. Tech.ChEMBL_873350 (CHEMBL2185203)
IC50 28000±n/a nM
Citation Orr, STRipp, SLBallard, TEHenderson, JLScott, DOObach, RSSun, HKalgutkar, AS Mechanism-based inactivation (MBI) of cytochrome P450 enzymes: structure-activity relationships and discovery strategies to mitigate drug-drug interaction risks. J Med Chem55:4896-933 (2012) 
 
Cytochrome P450 2C8
Name:Cytochrome P450 2C8
Type:Protein
Mol. Mass.:55839.23
Organism:Homo sapiens (Human)
Description:P10632
Residue:490
BDBM50397663
NameBDBM50397663
Synonyms:CHEMBL2181817
TypeSmall organic molecule
Emp. Form.C21H30O9
Mol. Mass.426.4575
SMILESCc1ccc(C)c(OCCCC(C)(C)C(=O)O[C@@H]2O[C@@H]([C@@H](O)[C@H](O)[C@H]2O)C(O)=O)c1