Reaction Details
TargetcAMP and cAMP-inhibited cGMP 3',5'-cyclic phosphodiesterase 10A
LigandBDBM50398003
Substrate/Competitorn/a
Meas. Tech.ChEMBL_873145 (CHEMBL2182994)
Ki 0.100000±n/a nM
Citation Chappie, TAHelal, CJHou, X Current landscape of phosphodiesterase 10A (PDE10A) inhibition. J Med Chem55:7299-331 (2012) 
 
cAMP and cAMP-inhibited cGMP 3',5'-cyclic phosphodiesterase 10A
Name:cAMP and cAMP-inhibited cGMP 3',5'-cyclic phosphodiesterase 10A
Type:Protein
Mol. Mass.:88412.52
Organism:Homo sapiens (Human)
Description:Q9Y233
Residue:1055
BDBM50398003
NameBDBM50398003
Synonyms:CHEMBL2180402
TypeSmall organic molecule
Emp. Form.C28H26N4O5
Mol. Mass.498.5298
SMILESCOc1ccc(cc1)-n1c(CCN2C(=O)c3cccc(OC(C)C)c3C2=O)nc2nc(C)ccc2c1=O