Reaction Details
TargetcAMP and cAMP-inhibited cGMP 3',5'-cyclic phosphodiesterase 10A
LigandBDBM50390812
Substrate/Competitorn/a
Meas. Tech.ChEMBL_872927 (CHEMBL2187458)
IC50 0.280000±n/a nM
Citation Chappie, TAHelal, CJHou, X Current landscape of phosphodiesterase 10A (PDE10A) inhibition. J Med Chem55:7299-331 (2012) 
 
cAMP and cAMP-inhibited cGMP 3',5'-cyclic phosphodiesterase 10A
Name:cAMP and cAMP-inhibited cGMP 3',5'-cyclic phosphodiesterase 10A
Type:Protein
Mol. Mass.:88412.52
Organism:Homo sapiens (Human)
Description:Q9Y233
Residue:1055
BDBM50390812
NameBDBM50390812
Synonyms:CHEMBL2069321
TypeSmall organic molecule
Emp. Form.C18H15ClN4O2
Mol. Mass.354.79
SMILESCOc1cc(OC)c2nnc3c(C)nc(-c4ccccc4Cl)n3c2c1