Reaction Details
TargetLysine-specific histone demethylase 1A
LigandBDBM50398074
Substrate/Competitorn/a
Meas. Tech.ChEMBL_873890 (CHEMBL2184301)
IC50 16800±n/a nM
Citation Hazeldine, SPachaiyappan, BSteinbergs, NNowotarski, SHanson, ASCasero, RAWoster, PM Low molecular weight amidoximes that act as potent inhibitors of lysine-specific demethylase 1. J Med Chem55:7378-91 (2012) 
 
Lysine-specific histone demethylase 1A
Name:Lysine-specific histone demethylase 1A
Type:Enzyme
Mol. Mass.:92901.01
Organism:Homo sapiens (Human)
Description:O60341
Residue:852
BDBM50398074
NameBDBM50398074
Synonyms:CHEMBL2181959
TypeSmall organic molecule
Emp. Form.C9H11N3O3
Mol. Mass.209.2019
SMILESONC(=N)CC(=O)Nc1ccccc1O