Reaction Details
TargetCannabinoid receptor 1
LigandBDBM50398220
Substrate/Competitorn/a
Meas. Tech.ChEMBL_874193 (CHEMBL2187925)
Ki 244±n/a nM
Citation Rempel, VVolz, NHinz, SKarcz, TMeliciani, INieger, MWenzel, WBräse, SMüller, CE 7-Alkyl-3-benzylcoumarins: a versatile scaffold for the development of potent and selective cannabinoid receptor agonists and antagonists. J Med Chem55:7967-77 (2012) 
 
Cannabinoid receptor 1
Name:Cannabinoid receptor 1
Type:G Protein-Coupled Receptor (GPCR)
Mol. Mass.:52868.96
Organism:Homo sapiens (Human)
Description:P21554
Residue:472
BDBM50398220
NameBDBM50398220
Synonyms:CHEMBL2181540
TypeSmall organic molecule
Emp. Form.C25H30O4
Mol. Mass.394.5033
SMILESCCCCCCC(C)(C)c1cc(O)c2cc(Cc3ccccc3O)c(=O)oc2c1