Reaction Details
TargetCannabinoid receptor 1
LigandBDBM50398236
Substrate/Competitorn/a
Meas. Tech.ChEMBL_874193 (CHEMBL2187925)
Ki 16200±n/a nM
Citation Rempel, VVolz, NHinz, SKarcz, TMeliciani, INieger, MWenzel, WBräse, SMüller, CE 7-Alkyl-3-benzylcoumarins: a versatile scaffold for the development of potent and selective cannabinoid receptor agonists and antagonists. J Med Chem55:7967-77 (2012) 
 
Cannabinoid receptor 1
Name:Cannabinoid receptor 1
Type:G Protein-Coupled Receptor (GPCR)
Mol. Mass.:52868.96
Organism:Homo sapiens (Human)
Description:P21554
Residue:472
BDBM50398236
NameBDBM50398236
Synonyms:CHEMBL2177250
TypeSmall organic molecule
Emp. Form.C21H22O4
Mol. Mass.338.397
SMILESCCCCCc1cc(O)c2cc(Cc3cccc(O)c3)c(=O)oc2c1