Reaction Details
TargetCannabinoid receptor 2
LigandBDBM50398237
Substrate/Competitorn/a
Meas. Tech.ChEMBL_874194 (CHEMBL2187926)
EC50 92±n/a nM
Citation Rempel, VVolz, NHinz, SKarcz, TMeliciani, INieger, MWenzel, WBräse, SMüller, CE 7-Alkyl-3-benzylcoumarins: a versatile scaffold for the development of potent and selective cannabinoid receptor agonists and antagonists. J Med Chem55:7967-77 (2012) 
 
Cannabinoid receptor 2
Name:Cannabinoid receptor 2
Type:G Protein-Coupled Receptor (GPCR)
Mol. Mass.:39690.94
Organism:Homo sapiens (Human)
Description:P34972
Residue:360
BDBM50398237
NameBDBM50398237
Synonyms:CHEMBL2177249
TypeSmall organic molecule
Emp. Form.C23H26O4
Mol. Mass.366.4501
SMILESCCCCCc1cc(OC)c2cc(Cc3cccc(OC)c3)c(=O)oc2c1