Reaction Details
TargetAcetylcholine-binding protein
LigandBDBM50382466
Substrate/Competitorn/a
Meas. Tech.ChEMBL_874929 (CHEMBL2183114)
Ki 12.8±n/a nM
Citation Zhang, HKEaton, JBYu, LFNys, MMazzolari, Avan Elk, RSmit, ABAlexandrov, VHanania, TSabath, EFedolak, ABrunner, DLukas, RJVistoli, GUlens, CKozikowski, AP Insights into the structural determinants required for high-affinity binding of chiral cyclopropane-containing ligands toa4ß2-nicotinic acetylcholine receptors: an integrated approach to behaviorally active nicotinic ligands. J Med Chem55:8028-37 (2012) 
 
Acetylcholine-binding protein
Name:Acetylcholine-binding protein
Type:n/a
Mol. Mass.:26055.52
Organism:Lymnaea stagnalis
Description:Soluble acetylcholine receptor
Residue:229
BDBM50382466
NameBDBM50382466
Synonyms:CHEMBL2024087
TypeSmall organic molecule
Emp. Form.C14H20N2O2
Mol. Mass.248.3208
SMILESOCC[C@H]1C[C@@H]1c1cncc(OC[C@@H]2CCN2)c1