Reaction Details
TargetNAD-dependent protein deacetylase sirtuin-2
LigandBDBM50396053
Substrate/Competitorn/a
Meas. Tech.ChEMBL_875593 (CHEMBL2184391)
IC50 10000±n/a nM
Citation Manjulatha, KSrinivas, SMulakayala, NRambabu, DPrabhakar, MArunasree, KMAlvala, MBasaveswara Rao, MVPal, M Ethylenediamine diacetate (EDDA) mediated synthesis of aurones under ultrasound: their evaluation as inhibitors of SIRT1. Bioorg Med Chem Lett22:6160-5 (2012) 
 
NAD-dependent protein deacetylase sirtuin-2
Name:NAD-dependent protein deacetylase sirtuin-2
Type:Hydrolase
Mol. Mass.:43172.62
Organism:Homo sapiens (Human)
Description:n/a
Residue:389
BDBM50396053
NameBDBM50396053
Synonyms:CHEMBL2170194
TypeSmall organic molecule
Emp. Form.C15H10N2O2S
Mol. Mass.282.317
SMILESO=[#6]1-[#7]-[#6](=S)-[#7]-[#6](=O)\[#6]-1=[#6]\c1cccc2ccccc12