Reaction Details
TargetTransient receptor potential cation channel subfamily V member 1
LigandBDBM50158658
Substrate/Competitorn/a
Meas. Tech.ChEMBL_872981 (CHEMBL2188275)
Ki 1.2±n/a nM
Citation Kim, MSRyu, HKang, DWCho, SHSeo, SPark, YSKim, MYKwak, EJKim, YSBhondwe, RSKim, HSPark, SGSon, KChoi, SDeAndrea-Lazarus, IAPearce, LVBlumberg, PMFrank, RBahrenberg, GStockhausen, HKögel, BYSchiene, KChristoph, TLee, J 2-(3-fluoro-4-methylsulfonylaminophenyl)propanamides as potent transient receptor potential vanilloid 1 (TRPV1) antagonists: structure-activity relationships of 2-amino derivatives in the N-(6-trifluoromethylpyridin-3-ylmethyl) C-region. J Med Chem55:8392-408 (2012) 
 
Transient receptor potential cation channel subfamily V member 1
Name:Transient receptor potential cation channel subfamily V member 1
Type:Protein
Mol. Mass.:94960.75
Organism:Homo sapiens (Human)
Description:Q8NER1
Residue:839
BDBM50158658
NameBDBM50158658
Synonyms:(E)-3-(2-Morpholin-4-yl-6-trifluoromethyl-pyridin-3-yl)-N-quinolin-7-yl-acrylamide CHEMBL191247
TypeSmall organic molecule
Emp. Form.C22H19F3N4O2
Mol. Mass.428.4071
SMILESFC(F)(F)c1ccc(\C=C\C(=O)Nc2ccc3cccnc3c2)c(n1)N1CCOCC1