Reaction Details
TargetTransient receptor potential cation channel subfamily V member 1
LigandBDBM50398484
Substrate/Competitorn/a
Meas. Tech.ChEMBL_872980 (CHEMBL2188274)
IC50 40±n/a nM
Citation Kim, MSRyu, HKang, DWCho, SHSeo, SPark, YSKim, MYKwak, EJKim, YSBhondwe, RSKim, HSPark, SGSon, KChoi, SDeAndrea-Lazarus, IAPearce, LVBlumberg, PMFrank, RBahrenberg, GStockhausen, HKögel, BYSchiene, KChristoph, TLee, J 2-(3-fluoro-4-methylsulfonylaminophenyl)propanamides as potent transient receptor potential vanilloid 1 (TRPV1) antagonists: structure-activity relationships of 2-amino derivatives in the N-(6-trifluoromethylpyridin-3-ylmethyl) C-region. J Med Chem55:8392-408 (2012) 
 
Transient receptor potential cation channel subfamily V member 1
Name:Transient receptor potential cation channel subfamily V member 1
Type:Protein
Mol. Mass.:94960.75
Organism:Homo sapiens (Human)
Description:Q8NER1
Residue:839
BDBM50398484
NameBDBM50398484
Synonyms:CHEMBL2177440
TypeSmall organic molecule
Emp. Form.C29H32F4N4O3S
Mol. Mass.592.648
SMILESCC(C(=O)NCc1ccc(nc1N1CCC(Cc2ccccc2)CC1)C(F)(F)F)c1ccc(NS(C)(=O)=O)c(F)c1