Reaction Details
TargetBeta-secretase 1
LigandBDBM50398614
Substrate/Competitorn/a
Meas. Tech.ChEMBL_874518 (CHEMBL2185270)
IC50 290±n/a nM
Citation Brodney, MABarreiro, GOgilvie, KHajos-Korcsok, EMurray, JVajdos, FAmbroise, CChristoffersen, CFisher, KLanyon, LLiu, JNolan, CEWithka, JMBorzilleri, KAEfremov, IOborski, CEVarghese, AO'Neill, BT Spirocyclic sulfamides asß-secretase 1 (BACE-1) inhibitors for the treatment of Alzheimer's disease: utilization of structure based drug design, WaterMap, and CNS penetration studies to identify centrally efficacious inhibitors. J Med Chem55:9224-39 (2012) 
 
Beta-secretase 1
Name:Beta-secretase 1
Type:Protein
Mol. Mass.:55755.10
Organism:Homo sapiens (Human)
Description:P56817
Residue:501
BDBM50398614
NameBDBM50398614
Synonyms:CHEMBL2177483
TypeSmall organic molecule
Emp. Form.C24H30FN5O2S
Mol. Mass.471.591
SMILESCCc1n[nH]c2ccc(CN3CC[C@]4(CN(C)S(=O)(=O)N4c4cccc(F)c4)C[C@@H]3C)cc12