Reaction Details
TargetBeta-secretase 1
LigandBDBM50398610
Substrate/Competitorn/a
Meas. Tech.ChEMBL_874519 (CHEMBL2185271)
IC50 100±n/a nM
Citation Brodney, MABarreiro, GOgilvie, KHajos-Korcsok, EMurray, JVajdos, FAmbroise, CChristoffersen, CFisher, KLanyon, LLiu, JNolan, CEWithka, JMBorzilleri, KAEfremov, IOborski, CEVarghese, AO'Neill, BT Spirocyclic sulfamides asß-secretase 1 (BACE-1) inhibitors for the treatment of Alzheimer's disease: utilization of structure based drug design, WaterMap, and CNS penetration studies to identify centrally efficacious inhibitors. J Med Chem55:9224-39 (2012) 
 
Beta-secretase 1
Name:Beta-secretase 1
Type:Protein
Mol. Mass.:55755.10
Organism:Homo sapiens (Human)
Description:P56817
Residue:501
BDBM50398610
NameBDBM50398610
Synonyms:CHEMBL2177470
TypeSmall organic molecule
Emp. Form.C24H32FN3O4S
Mol. Mass.477.592
SMILESCC(C)Oc1cc(CN2CC[C@]3(CN(C)S(=O)(=O)N3c3cccc(F)c3)C[C@@H]2C)ccc1O