Reaction Details
TargetMu-type opioid receptor
LigandBDBM50398947
Substrate/Competitorn/a
Meas. Tech.ChEMBL_875495 (CHEMBL2183136)
Ki 0.9±n/a nM
Citation Moynihan, HADerrick, IBroadbear, JHGreedy, BMAceto, MDHarris, LSPurington, LCThomas, MPWoods, JHTraynor, JRHusbands, SMLewis, JW Fumaroylamino-4,5-epoxymorphinans and related opioids with irreversibleµ opioid receptor antagonist effects. J Med Chem55:9868-74 (2012) 
 
Mu-type opioid receptor
Name:Mu-type opioid receptor
Type:Enzyme Catalytic Domain
Mol. Mass.:11165.58
Organism:GUINEA PIG
Description:P97266
Residue:98
BDBM50398947
NameBDBM50398947
Synonyms:CHEMBL2179262
TypeSmall organic molecule
Emp. Form.C32H36N2O4
Mol. Mass.512.6392
SMILESCO[C@]12CC[C@@]3(C[C@@H]1NC(=O)\C=C\c1ccccc1)[C@H]1Cc4ccc(O)c5O[C@@H]2[C@]3(CCN1CC1CC1)c45