Reaction Details
TargetCarbonic anhydrase 5B, mitochondrial
LigandBDBM50399075
Substrate/Competitorn/a
Meas. Tech.ChEMBL_878784 (CHEMBL2183724)
Ki 3270±n/a nM
Citation Marini, AMMaresca, AAggarwal, MOrlandini, ENencetti, SDa Settimo, FSalerno, SSimorini, FLa Motta, CTaliani, SNuti, EScozzafava, AMcKenna, RRossello, ASupuran, CT Tricyclic sulfonamides incorporating benzothiopyrano[4,3-c]pyrazole and pyridothiopyrano[4,3-c]pyrazole effectively inhibita- andß-carbonic anhydrase: X-ray crystallography and solution investigations on 15 isoforms. J Med Chem55:9619-29 (2012) 
 
Carbonic anhydrase 5B, mitochondrial
Name:Carbonic anhydrase 5B, mitochondrial
Type:Enzyme
Mol. Mass.:36440.83
Organism:Homo sapiens (Human)
Description:Human (cloned) isozyme
Residue:317
BDBM50399075
NameBDBM50399075
Synonyms:CHEMBL2179304
TypeSmall organic molecule
Emp. Form.C16H14N4O2S2
Mol. Mass.358.438
SMILESCc1ccc2-c3c(CSc2n1)cnn3-c1ccc(cc1)S(N)(=O)=O