Reaction Details
TargetCarbonic anhydrase 7
LigandBDBM50399076
Substrate/Competitorn/a
Meas. Tech.ChEMBL_878782 (CHEMBL2183722)
Ki 873±n/a nM
Citation Marini, AMMaresca, AAggarwal, MOrlandini, ENencetti, SDa Settimo, FSalerno, SSimorini, FLa Motta, CTaliani, SNuti, EScozzafava, AMcKenna, RRossello, ASupuran, CT Tricyclic sulfonamides incorporating benzothiopyrano[4,3-c]pyrazole and pyridothiopyrano[4,3-c]pyrazole effectively inhibita- andß-carbonic anhydrase: X-ray crystallography and solution investigations on 15 isoforms. J Med Chem55:9619-29 (2012) 
 
Carbonic anhydrase 7
Name:Carbonic anhydrase 7
Type:Enzyme
Mol. Mass.:29664.11
Organism:Homo sapiens (Human)
Description:Human cloned isozyme.
Residue:264
BDBM50399076
NameBDBM50399076
Synonyms:CHEMBL2179305
TypeSmall organic molecule
Emp. Form.C15H12N4O2S2
Mol. Mass.344.411
SMILESNS(=O)(=O)c1ccc(cc1)-n1ncc2CSc3ncccc3-c12