Reaction Details
TargetCarbonic anhydrase 2
LigandBDBM50399076
Substrate/Competitorn/a
Meas. Tech.ChEMBL_878788 (CHEMBL2183728)
Ki 72±n/a nM
Citation Marini, AMMaresca, AAggarwal, MOrlandini, ENencetti, SDa Settimo, FSalerno, SSimorini, FLa Motta, CTaliani, SNuti, EScozzafava, AMcKenna, RRossello, ASupuran, CT Tricyclic sulfonamides incorporating benzothiopyrano[4,3-c]pyrazole and pyridothiopyrano[4,3-c]pyrazole effectively inhibita- andß-carbonic anhydrase: X-ray crystallography and solution investigations on 15 isoforms. J Med Chem55:9619-29 (2012) 
 
Carbonic anhydrase 2
Name:Carbonic anhydrase 2
Type:Enzyme
Mol. Mass.:29250.71
Organism:Homo sapiens (Human)
Description:P00918
Residue:260
BDBM50399076
NameBDBM50399076
Synonyms:CHEMBL2179305
TypeSmall organic molecule
Emp. Form.C15H12N4O2S2
Mol. Mass.344.411
SMILESNS(=O)(=O)c1ccc(cc1)-n1ncc2CSc3ncccc3-c12