Reaction Details
TargetCarbonic anhydrase 9
LigandBDBM50399077
Substrate/Competitorn/a
Meas. Tech.ChEMBL_878780 (CHEMBL2183720)
Ki 2570±n/a nM
Citation Marini, AMMaresca, AAggarwal, MOrlandini, ENencetti, SDa Settimo, FSalerno, SSimorini, FLa Motta, CTaliani, SNuti, EScozzafava, AMcKenna, RRossello, ASupuran, CT Tricyclic sulfonamides incorporating benzothiopyrano[4,3-c]pyrazole and pyridothiopyrano[4,3-c]pyrazole effectively inhibita- andß-carbonic anhydrase: X-ray crystallography and solution investigations on 15 isoforms. J Med Chem55:9619-29 (2012) 
 
Carbonic anhydrase 9
Name:Carbonic anhydrase 9
Type:Enzyme
Mol. Mass.:49669.03
Organism:Homo sapiens (Human)
Description:Catalytic domain of human cloned isozyme was used in the assay
Residue:459
BDBM50399077
NameBDBM50399077
Synonyms:CHEMBL2179306
TypeSmall organic molecule
Emp. Form.C17H12F3N3O2S2
Mol. Mass.411.421
SMILESNS(=O)(=O)c1ccc(cc1)-n1ncc2CSc3cc(ccc3-c12)C(F)(F)F